Reaction Details
TargetcGMP-specific 3',5'-cyclic phosphodiesterase
LigandBDBM131006
Substrate/Competitorn/a
Meas. Tech.Inhibition Assay
Temperature303.15±n/a K
IC50 1259±n/a nM
Commentsextracted
Citation Okada, MSato, SKawade, KGotanda, KShinbo, ANakano, YKobayashi, H Substituted imidazo[1,5-A]quinoxalines as phosphodiesterase 9 inhibitors US Patent US8829000 Publication Date 9/9/2014
 
cGMP-specific 3',5'-cyclic phosphodiesterase
Name:cGMP-specific 3',5'-cyclic phosphodiesterase
Type:Protein
Mol. Mass.:99975.83
Organism:Homo sapiens (Human)
Description:O76074
Residue:875
BDBM131006
NameBDBM131006
Synonyms:US8829000, 6
TypeSmall organic molecule
Emp. Form.C13H12ClN3O
Mol. Mass.261.707
SMILESCC(C)c1ncc2n1c1ccc(Cl)cc1[nH]c2=O