Reaction Details
TargetcGMP-specific 3',5'-cyclic phosphodiesterase
LigandBDBM131007
Substrate/Competitorn/a
Meas. Tech.Inhibition Assay
Temperature303.15±n/a K
IC50>10000±n/a nM
Commentsextracted
Citation Okada, MSato, SKawade, KGotanda, KShinbo, ANakano, YKobayashi, H Substituted imidazo[1,5-A]quinoxalines as phosphodiesterase 9 inhibitors US Patent US8829000 Publication Date 9/9/2014
 
cGMP-specific 3',5'-cyclic phosphodiesterase
Name:cGMP-specific 3',5'-cyclic phosphodiesterase
Type:Protein
Mol. Mass.:99975.83
Organism:Homo sapiens (Human)
Description:O76074
Residue:875
BDBM131007
NameBDBM131007
Synonyms:US8829000, 9
TypeSmall organic molecule
Emp. Form.C16H18N4O2
Mol. Mass.298.3397
SMILESCC(C)c1ncc2n1c1ccc(cc1[nH]c2=O)C(=O)N(C)C