Reaction Details
TargetDihydrofolate reductase
LigandBDBM131837
Substrate/Competitorn/a
Meas. Tech.Inhibition Assay
Ki 0.66±n/a nM
Citation Chen, ZCreighton, CJCunningham, MFinn, JHilgers, MJung, MKohnen, LALam, TLi, XStidham, MTari, LTrzoss, MZhang, J Dihydrofolate reductase inhibitors US Patent US8835445 Publication Date 9/16/2014
 
Dihydrofolate reductase
Name:Dihydrofolate reductase
Type:Enzyme
Mol. Mass.:18249.71
Organism:Staphylococcus aureus
Description:n/a
Residue:159
BDBM131837
NameBDBM131837
Synonyms:US8835445, 8
TypeSmall organic molecule
Emp. Form.C17H18N4O2
Mol. Mass.310.3504
SMILESCOc1ccc(CO)cc1-c1cc2nc(N)nc(N)c2cc1C