Reaction Details
TargetDihydrofolate reductase
LigandBDBM131842
Substrate/Competitorn/a
Meas. Tech.Inhibition Assay
Ki 0.5±n/a nM
Citation Chen, ZCreighton, CJCunningham, MFinn, JHilgers, MJung, MKohnen, LALam, TLi, XStidham, MTari, LTrzoss, MZhang, J Dihydrofolate reductase inhibitors US Patent US8835445 Publication Date 9/16/2014
 
Dihydrofolate reductase
Name:Dihydrofolate reductase
Type:Enzyme
Mol. Mass.:18249.71
Organism:Staphylococcus aureus
Description:n/a
Residue:159
BDBM131842
NameBDBM131842
Synonyms:US8835445, 13
TypeSmall organic molecule
Emp. Form.C17H15N5
Mol. Mass.289.3345
SMILESCc1cc2c(N)nc(N)nc2cc1-c1cccc(C[N+]#[C-])c1