Reaction Details
TargetDihydrofolate reductase
LigandBDBM50448753
Substrate/Competitorn/a
Meas. Tech.Inhibition Assay
Ki 0.022±n/a nM
Citation Chen, ZCreighton, CJCunningham, MFinn, JHilgers, MJung, MKohnen, LALam, TLi, XStidham, MTari, LTrzoss, MZhang, J Dihydrofolate reductase inhibitors US Patent US8835445 Publication Date 9/16/2014
 
Dihydrofolate reductase
Name:Dihydrofolate reductase
Type:Enzyme
Mol. Mass.:18249.71
Organism:Staphylococcus aureus
Description:n/a
Residue:159
BDBM50448753
NameBDBM50448753
Synonyms:CHEMBL3127912 | US8835445, 16
TypeSmall organic molecule
Emp. Form.C22H19N7
Mol. Mass.381.4332
SMILESCc1cc2nc(-c3ccccn3)n(-c3ccc4c(N)nc(N)nc4c3)c2cc1C