Reaction Details
TargetDihydrofolate reductase
LigandBDBM50448744
Substrate/Competitorn/a
Meas. Tech.Inhibition Assay
Ki 0.016±n/a nM
Citation Chen, ZCreighton, CJCunningham, MFinn, JHilgers, MJung, MKohnen, LALam, TLi, XStidham, MTari, LTrzoss, MZhang, J Dihydrofolate reductase inhibitors US Patent US8835445 Publication Date 9/16/2014
 
Dihydrofolate reductase
Name:Dihydrofolate reductase
Type:Enzyme
Mol. Mass.:18249.71
Organism:Staphylococcus aureus
Description:n/a
Residue:159
BDBM50448744
NameBDBM50448744
Synonyms:CHEMBL3128014 US8835445, 34
TypeSmall organic molecule
Emp. Form.C20H16ClN7S
Mol. Mass.421.906
SMILESCc1cc2nc(-c3nccs3)n(-c3cc4nc(N)nc(N)c4cc3Cl)c2cc1C