Reaction Details
TargetAcetylcholinesterase
LigandBDBM132075
Substrate/Competitorn/a
Meas. Tech.Inhibition Assay
IC50 20.05±n/a nM
Citation Zawadzka, ACzarnocki, ZLozinska, IMoleda, ZPanasiewicz, M Hybrid cholinesterase inhibitors US Patent US8841453 Publication Date 9/23/2014
 
Acetylcholinesterase
Name:Acetylcholinesterase
Type:Enzyme
Mol. Mass.:67792.70
Organism:Homo sapiens (Human)
Description:P22303
Residue:614
BDBM132075
NameBDBM132075
Synonyms:US8841453, 5
TypeSmall organic molecule
Emp. Form.C28H30ClN5O3
Mol. Mass.520.023
SMILESCC(=O)NCCc1c[nH]c2ccc(OC(=O)NCCNc3c4CCCCc4nc4cc(Cl)ccc34)cc12