Reaction Details
TargetAcetylcholinesterase
LigandBDBM132083
Substrate/Competitorn/a
Meas. Tech.Inhibition Assay
IC50 1.18±n/a nM
Citation Zawadzka, ACzarnocki, ZLozinska, IMoleda, ZPanasiewicz, M Hybrid cholinesterase inhibitors US Patent US8841453 Publication Date 9/23/2014
 
Acetylcholinesterase
Name:Acetylcholinesterase
Type:Enzyme
Mol. Mass.:67792.70
Organism:Homo sapiens (Human)
Description:P22303
Residue:614
BDBM132083
NameBDBM132083
Synonyms:US8841453, 14
TypeSmall organic molecule
Emp. Form.C36H47N5O3
Mol. Mass.597.7901
SMILESCC(=O)NCCc1c[nH]c2ccc(OC(=O)NCCCCCCCCCCNc3c4CCCCc4nc4ccccc34)cc12