Reaction Details
TargetAcetylcholinesterase
LigandBDBM132087
Substrate/Competitorn/a
Meas. Tech.Inhibition Assay
IC50 25.6±n/a nM
Citation Zawadzka, ACzarnocki, ZLozinska, IMoleda, ZPanasiewicz, M Hybrid cholinesterase inhibitors US Patent US8841453 Publication Date 9/23/2014
 
Acetylcholinesterase
Name:Acetylcholinesterase
Type:Enzyme
Mol. Mass.:67792.70
Organism:Homo sapiens (Human)
Description:P22303
Residue:614
BDBM132087
NameBDBM132087
Synonyms:US8841453, 19
TypeSmall organic molecule
Emp. Form.C38H50ClN5O3
Mol. Mass.660.288
SMILESCC(=O)NCCc1c[nH]c2ccc(OC(=O)NCCCCCCCCCCCCNc3c4CCCCc4nc4cc(Cl)ccc34)cc12