Reaction Details
TargetCholinesterase
LigandBDBM132081
Substrate/Competitorn/a
Meas. Tech.Inhibition Assay
IC50 0.88±n/a nM
Citation Zawadzka, ACzarnocki, ZLozinska, IMoleda, ZPanasiewicz, M Hybrid cholinesterase inhibitors US Patent US8841453 Publication Date 9/23/2014
 
Cholinesterase
Name:Cholinesterase
Type:Homotetramer
Mol. Mass.:68422.27
Organism:Homo sapiens (Human)
Description:P06276
Residue:602
BDBM132081
NameBDBM132081
Synonyms:US8841453, 12
TypeSmall organic molecule
Emp. Form.C33H40ClN5O3
Mol. Mass.590.155
SMILESCC(=O)NCCc1c[nH]c2ccc(OC(=O)NCCCCCCCNc3c4CCCCc4nc4ccc(Cl)cc34)cc12