Reaction Details
TargetSteroid 17-alpha-hydroxylase/17,20 lyase
LigandBDBM132182
Substrate/Competitorn/a
Meas. Tech.Enzyme Assay
IC50 2.5±n/a nM
Citation Bock, MGGaul, CGunmadi, VRSengupta, S Inhibitors of CYP 17 US Patent US Patent
 
Steroid 17-alpha-hydroxylase/17,20 lyase
Name:Steroid 17-alpha-hydroxylase/17,20 lyase
Type:Enzyme
Mol. Mass.:57382.42
Organism:Homo sapiens (Human)
Description:E.coli expressing human CYP17
Residue:508
BDBM132182
NameBDBM132182
Synonyms:USRE45173, 121A
TypeSmall organic molecule
Emp. Form.C16H15N5O
Mol. Mass.293.3232
SMILESCc1ccncc1N1CCN(C1=O)c1ccc2cn[nH]c2c1