Reaction Details
TargetCyclin-dependent kinase 4
LigandBDBM132271
Substrate/Competitorn/a
Meas. Tech.In Vitro Assay
pH7.4±n/a
Temperature310.15±n/a K
IC50 1±n/a nM
Citation Connors, RVKang, DEksterowicz, JFan, PFisher, BFu, JLi, KLi, ZMcGee, LRSharma, RWang, XMcMinn, DLMihalic, JTDeignan, J Fused pyridine, pyrimidine and triazine compounds as cell cycle inhibitors US Patent US8841312 Publication Date 9/23/2014
 
Cyclin-dependent kinase 4
Name:Cyclin-dependent kinase 4
Type:Enzyme Subunit
Mol. Mass.:33731.96
Organism:Homo sapiens (Human)
Description:P11802
Residue:303
BDBM132271
NameBDBM132271
Synonyms:US8841312, 13
TypeSmall organic molecule
Emp. Form.C25H31N9
Mol. Mass.457.5739
SMILESCN(C)C1CCN(CC1)c1ccc(Nc2ncc3c(n2)n(C2CCCC2)c2cnccc32)nn1