Reaction Details
TargetCyclin-dependent kinase 4
LigandBDBM132279
Substrate/Competitorn/a
Meas. Tech.In Vitro Assay
pH7.4±n/a
Temperature310.15±n/a K
IC50 1±n/a nM
Citation Connors, RVKang, DEksterowicz, JFan, PFisher, BFu, JLi, KLi, ZMcGee, LRSharma, RWang, XMcMinn, DLMihalic, JTDeignan, J Fused pyridine, pyrimidine and triazine compounds as cell cycle inhibitors US Patent US8841312 Publication Date 9/23/2014
 
Cyclin-dependent kinase 4
Name:Cyclin-dependent kinase 4
Type:Enzyme Subunit
Mol. Mass.:33731.96
Organism:Homo sapiens (Human)
Description:P11802
Residue:303
BDBM132279
NameBDBM132279
Synonyms:US8841312, 21
TypeSmall organic molecule
Emp. Form.C26H30N6
Mol. Mass.426.5566
SMILESC1CCC(CC1)n1c2ccccc2c2cnc(Nc3ccc(cc3)N3CCNCC3)nc12