Reaction Details
TargetCyclin-dependent kinase 4
LigandBDBM132471
Substrate/Competitorn/a
Meas. Tech.In Vitro Assay
pH7.4±n/a
Temperature310.15±n/a K
IC50 1±n/a nM
Citation Connors, RVKang, DEksterowicz, JFan, PFisher, BFu, JLi, KLi, ZMcGee, LRSharma, RWang, XMcMinn, DLMihalic, JTDeignan, J Fused pyridine, pyrimidine and triazine compounds as cell cycle inhibitors US Patent US8841312 Publication Date 9/23/2014
 
Cyclin-dependent kinase 4
Name:Cyclin-dependent kinase 4
Type:Enzyme Subunit
Mol. Mass.:33731.96
Organism:Homo sapiens (Human)
Description:P11802
Residue:303
BDBM132471
NameBDBM132471
Synonyms:US8841312, 220
TypeSmall organic molecule
Emp. Form.C26H30N8O2
Mol. Mass.486.5688
SMILESOC(=O)CN1CCN(Cc2ccc(Nc3ncc4c5ccncc5n(C5CCCC5)c4n3)nc2)CC1