Reaction Details
TargetCyclin-dependent kinase 6
LigandBDBM132276
Substrate/Competitorn/a
Meas. Tech.In Vitro Assay
pH7.4±n/a
Temperature310.15±n/a K
IC50 1.5±n/a nM
Citation Connors, RVKang, DEksterowicz, JFan, PFisher, BFu, JLi, KLi, ZMcGee, LRSharma, RWang, XMcMinn, DLMihalic, JTDeignan, J Fused pyridine, pyrimidine and triazine compounds as cell cycle inhibitors US Patent US8841312 Publication Date 9/23/2014
 
Cyclin-dependent kinase 6
Name:Cyclin-dependent kinase 6
Type:Enzyme Subunit
Mol. Mass.:36937.42
Organism:Homo sapiens (Human)
Description:Q00534
Residue:326
BDBM132276
NameBDBM132276
Synonyms:US8841312, 18
TypeSmall organic molecule
Emp. Form.C22H24N8O
Mol. Mass.416.479
SMILESO[C@@H]1CCN(C1)c1ccc(Nc2ncc3c(n2)n(C2CCCC2)c2cnccc32)nn1