Reaction Details
TargetCyclin-dependent kinase 6
LigandBDBM132304
Substrate/Competitorn/a
Meas. Tech.In Vitro Assay
pH7.4±n/a
Temperature310.15±n/a K
IC50 3.7±n/a nM
Citation Connors, RVKang, DEksterowicz, JFan, PFisher, BFu, JLi, KLi, ZMcGee, LRSharma, RWang, XMcMinn, DLMihalic, JTDeignan, J Fused pyridine, pyrimidine and triazine compounds as cell cycle inhibitors US Patent US8841312 Publication Date 9/23/2014
 
Cyclin-dependent kinase 6
Name:Cyclin-dependent kinase 6
Type:Enzyme Subunit
Mol. Mass.:36937.42
Organism:Homo sapiens (Human)
Description:Q00534
Residue:326
BDBM132304
NameBDBM132304
Synonyms:US8841312, 47
TypeSmall organic molecule
Emp. Form.C25H28N6
Mol. Mass.412.53
SMILESC1CCC(C1)n1c2ccccc2c2cnc(Nc3ccc(cc3)N3CCNCC3)nc12