Reaction Details
TargetCyclin-dependent kinase 6
LigandBDBM132476
Substrate/Competitorn/a
Meas. Tech.In Vitro Assay
pH7.4±n/a
Temperature310.15±n/a K
IC50 3±n/a nM
Citation Connors, RVKang, DEksterowicz, JFan, PFisher, BFu, JLi, KLi, ZMcGee, LRSharma, RWang, XMcMinn, DLMihalic, JTDeignan, J Fused pyridine, pyrimidine and triazine compounds as cell cycle inhibitors US Patent US8841312 Publication Date 9/23/2014
 
Cyclin-dependent kinase 6
Name:Cyclin-dependent kinase 6
Type:Enzyme Subunit
Mol. Mass.:36937.42
Organism:Homo sapiens (Human)
Description:Q00534
Residue:326
BDBM132476
NameBDBM132476
Synonyms:US8841312, 225
TypeSmall organic molecule
Emp. Form.C24H26N8O
Mol. Mass.442.5162
SMILESO=C1CN(Cc2ccc(Nc3ncc4c5ccncc5n(C5CCCC5)c4n3)nc2)CCN1