Reaction Details
TargetSodium/glucose cotransporter 1
LigandBDBM132862
Substrate/Competitorn/a
Meas. Tech.Inhibition Assay
Temperature310.15±n/a K
IC50 0.9±n/a nM
Commentsextracted
Citation Miura, TOgoshi, YUeyama, KMotoda, DIwayama, TSuzawa, KNagamori, HUeno, HTakahashi, ASugimoto, K Pyrazole compound and pharmaceutical use thereof US Patent US8846746 Publication Date 9/30/2014
 
Sodium/glucose cotransporter 1
Name:Sodium/glucose cotransporter 1
Type:Protein
Mol. Mass.:73503.78
Organism:Homo sapiens (Human)
Description:P13866
Residue:664
BDBM132862
NameBDBM132862
Synonyms:US8846746, 132
TypeSmall organic molecule
Emp. Form.C24H25ClN4O2
Mol. Mass.436.934
SMILESCC(C)(C)c1cccc(c1)-c1cc(NC(=O)[C@H]2CNC(=O)C2)nn1-c1ccccc1Cl