Reaction Details
TargetSodium/glucose cotransporter 1
LigandBDBM132868
Substrate/Competitorn/a
Meas. Tech.Inhibition Assay
Temperature310.15±n/a K
IC50 1.5±n/a nM
Commentsextracted
Citation Miura, TOgoshi, YUeyama, KMotoda, DIwayama, TSuzawa, KNagamori, HUeno, HTakahashi, ASugimoto, K Pyrazole compound and pharmaceutical use thereof US Patent US8846746 Publication Date 9/30/2014
 
Sodium/glucose cotransporter 1
Name:Sodium/glucose cotransporter 1
Type:Protein
Mol. Mass.:73503.78
Organism:Homo sapiens (Human)
Description:P13866
Residue:664
BDBM132868
NameBDBM132868
Synonyms:US8846746, 138
TypeSmall organic molecule
Emp. Form.C24H24F2N4O2
Mol. Mass.438.4698
SMILESCC(C)C(F)(F)c1cccc(c1)-c1cc(NC(=O)[C@H]2CNC(=O)C2)nn1-c1ccccc1