Reaction Details
TargetCannabinoid receptor 2
LigandBDBM133287
Substrate/Competitorn/a
Meas. Tech.Radioligand Binding Assay
pH7.4±n/a
Temperature303.15±n/a K
Ki 0.4±n/a nM
Commentsextracted
Citation Carroll, WADart, MJFrost, JMKolasa, TLi, TLiu, BPerez-Medrano, APatel, MWang, XPeddi, S Compounds as cannabinoid receptor ligands US Patent US8846730 Publication Date 9/30/2014
 
Cannabinoid receptor 2
Name:Cannabinoid receptor 2
Type:G Protein-Coupled Receptor (GPCR)
Mol. Mass.:39690.94
Organism:Homo sapiens (Human)
Description:P34972
Residue:360
BDBM133287
NameBDBM133287
Synonyms:US8846730, 40
TypeSmall organic molecule
Emp. Form.C25H33F3N4O4S
Mol. Mass.542.614
SMILESCC(C)(C)OC(=O)NNc1ccc(cc1C(=O)\N=c1\sc(cn1C[C@H]1CCCO1)C(C)(C)C)C(F)(F)F