Reaction Details
TargetCannabinoid receptor 2
LigandBDBM133275
Substrate/Competitorn/a
Meas. Tech.Radioligand Binding Assay
pH7.4±n/a
Temperature303.15±n/a K
Ki 0.5±n/a nM
Commentsextracted
Citation Carroll, WADart, MJFrost, JMKolasa, TLi, TLiu, BPerez-Medrano, APatel, MWang, XPeddi, S Compounds as cannabinoid receptor ligands US Patent US8846730 Publication Date 9/30/2014
 
Cannabinoid receptor 2
Name:Cannabinoid receptor 2
Type:Enzyme
Mol. Mass.:39366.68
Organism:Rattus norvegicus (Rat)
Description:Q9QZN9
Residue:360
BDBM133275
NameBDBM133275
Synonyms:US8846730, 22
TypeSmall organic molecule
Emp. Form.C25H31F3N2O4S
Mol. Mass.512.585
SMILESCC(C)(C)c1cn(C[C@H]2CCCO2)\c(=N\C(=O)c2cc(ccc2OC[C@H]2CCCO2)C(F)(F)F)s1