Reaction Details
TargetCannabinoid receptor 2
LigandBDBM133313
Substrate/Competitorn/a
Meas. Tech.Radioligand Binding Assay
pH7.4±n/a
Temperature303.15±n/a K
Ki 0.5±n/a nM
Commentsextracted
Citation Carroll, WADart, MJFrost, JMKolasa, TLi, TLiu, BPerez-Medrano, APatel, MWang, XPeddi, S Compounds as cannabinoid receptor ligands US Patent US8846730 Publication Date 9/30/2014
 
Cannabinoid receptor 2
Name:Cannabinoid receptor 2
Type:Enzyme
Mol. Mass.:39366.68
Organism:Rattus norvegicus (Rat)
Description:Q9QZN9
Residue:360
BDBM133313
NameBDBM133313
Synonyms:US8846730, 79
TypeSmall organic molecule
Emp. Form.C23H30F3N3O3S
Mol. Mass.485.563
SMILESCC(C)NOc1ccc(cc1C(=O)\N=c1/sc(cn1C[C@H]1CCCO1)C(C)(C)C)C(F)(F)F