Reaction Details
TargetCannabinoid receptor 2
LigandBDBM9812
Substrate/Competitorn/a
Meas. Tech.Radioligand Binding Assay
pH7.4±n/a
Temperature303.15±n/a K
Ki 0.9±n/a nM
Commentsextracted
Citation Carroll, WADart, MJFrost, JMKolasa, TLi, TLiu, BPerez-Medrano, APatel, MWang, XPeddi, S Compounds as cannabinoid receptor ligands US Patent US8846730 Publication Date 9/30/2014
 
Cannabinoid receptor 2
Name:Cannabinoid receptor 2
Type:Enzyme
Mol. Mass.:39366.68
Organism:Rattus norvegicus (Rat)
Description:Q9QZN9
Residue:360
BDBM9812
NameBDBM9812
Synonyms:US8846730, 69
Typen/a
Emp. Form.C17H16Cl2N2O3
Mol. Mass.367.227
SMILESClc1ccc(OCCCC(=O)NN\C=C2/C=CC=CC2=O)c(Cl)c1