Reaction Details
TargetGamma-aminobutyric acid receptor subunit alpha-5
LigandBDBM133563
Substrate/Competitorn/a
Meas. Tech.Radioligand Binding Assay
pH7.5±n/a
Temperature277.15±n/a K
Ki 0.8±n/a nM
Commentsextracted
Citation Buettelmann, BJakob-Roetne, RKnust, HLucas, MCThomas, A Isoxazolo-pyridine derivatives US Patent US8846719 Publication Date 9/30/2014
 
Gamma-aminobutyric acid receptor subunit alpha-5
Name:Gamma-aminobutyric acid receptor subunit alpha-5
Type:Enzyme
Mol. Mass.:52160.59
Organism:Homo sapiens (Human)
Description:P31644
Residue:462
BDBM133563
NameBDBM133563
Synonyms:US8846719, 255
TypeSmall organic molecule
Emp. Form.C21H18ClN5O3
Mol. Mass.423.852
SMILESCc1onc(c1COc1ccc(cn1)C(=O)Nc1cnn(C)c1)-c1ccc(Cl)cc1