Reaction Details
TargetGamma-aminobutyric acid receptor subunit alpha-5
LigandBDBM133567
Substrate/Competitorn/a
Meas. Tech.Radioligand Binding Assay
pH7.5±n/a
Temperature277.15±n/a K
Ki 0.7±n/a nM
Commentsextracted
Citation Buettelmann, BJakob-Roetne, RKnust, HLucas, MCThomas, A Isoxazolo-pyridine derivatives US Patent US8846719 Publication Date 9/30/2014
 
Gamma-aminobutyric acid receptor subunit alpha-5
Name:Gamma-aminobutyric acid receptor subunit alpha-5
Type:Enzyme
Mol. Mass.:52160.59
Organism:Homo sapiens (Human)
Description:P31644
Residue:462
BDBM133567
NameBDBM133567
Synonyms:US8846719, 259
TypeSmall organic molecule
Emp. Form.C22H22ClN3O4
Mol. Mass.427.881
SMILESCc1onc(c1COc1ccc(cn1)C(=O)N[C@@H]1CCC[C@H]1O)-c1ccc(Cl)cc1