Reaction Details
TargetGamma-aminobutyric acid receptor subunit alpha-5
LigandBDBM10484
Substrate/Competitorn/a
Meas. Tech.Radioligand Binding Assay
pH7.5±n/a
Temperature277.15±n/a K
Ki 0.3±n/a nM
Commentsextracted
Citation Buettelmann, BJakob-Roetne, RKnust, HLucas, MCThomas, A Isoxazolo-pyridine derivatives US Patent US8846719 Publication Date 9/30/2014
 
Gamma-aminobutyric acid receptor subunit alpha-5
Name:Gamma-aminobutyric acid receptor subunit alpha-5
Type:Enzyme
Mol. Mass.:52160.59
Organism:Homo sapiens (Human)
Description:P31644
Residue:462
BDBM10484
NameBDBM10484
Synonyms:US11091471, Example RO-301 | US8846719, 301
Typen/a
Emp. Form.C21H21ClN4O4
Mol. Mass.428.869
SMILESCc1onc(c1COc1ccc(cn1)C(=O)NC1CCOCC1)-c1ccc(Cl)cn1