Reaction Details
TargetGamma-aminobutyric acid receptor subunit alpha-5
LigandBDBM10668
Substrate/Competitorn/a
Meas. Tech.Radioligand Binding Assay
pH7.5±n/a
Temperature277.15±n/a K
Ki 1.1±n/a nM
Commentsextracted
Citation Buettelmann, BJakob-Roetne, RKnust, HLucas, MCThomas, A Isoxazolo-pyridine derivatives US Patent US8846719 Publication Date 9/30/2014
 
Gamma-aminobutyric acid receptor subunit alpha-5
Name:Gamma-aminobutyric acid receptor subunit alpha-5
Type:Enzyme
Mol. Mass.:52160.59
Organism:Homo sapiens (Human)
Description:P31644
Residue:462
BDBM10668
NameBDBM10668
Synonyms:US8846719, 285
Typen/a
Emp. Form.C19H26N4O4
Mol. Mass.374.4341
SMILESCOCCNC(=O)c1ccc(OCc2c(C)onc2C2CCCCN2)nc1