Reaction Details
TargetGamma-aminobutyric acid receptor subunit alpha-5
LigandBDBM10677
Substrate/Competitorn/a
Meas. Tech.Radioligand Binding Assay
pH7.5±n/a
Temperature277.15±n/a K
Ki 0.6±n/a nM
Commentsextracted
Citation Buettelmann, BJakob-Roetne, RKnust, HLucas, MCThomas, A Isoxazolo-pyridine derivatives US Patent US8846719 Publication Date 9/30/2014
 
Gamma-aminobutyric acid receptor subunit alpha-5
Name:Gamma-aminobutyric acid receptor subunit alpha-5
Type:Enzyme
Mol. Mass.:52160.59
Organism:Homo sapiens (Human)
Description:P31644
Residue:462
BDBM10677
NameBDBM10677
Synonyms:US8846719, 290
Typen/a
Emp. Form.C19H23FN4O3
Mol. Mass.374.4093
SMILESCc1onc(C2CCC(F)CN2)c1COc1ccc(cn1)C(=O)NC1CC1