Reaction Details
TargetCannabinoid receptor 2
LigandBDBM143560
Substrate/Competitorn/a
Meas. Tech.cAMP Assay
Temperature300.15±n/a K
EC50 67±n/a nM
Commentsextracted
Citation Macielag, MJZhang, YDeCorte, BLGreco, MN Quinazoline derivatives useful as CB-1 inverse agonists US Patent US9682955 Publication Date 6/20/2017
 
Cannabinoid receptor 2
Name:Cannabinoid receptor 2
Type:G Protein-Coupled Receptor (GPCR)
Mol. Mass.:39690.94
Organism:Homo sapiens (Human)
Description:P34972
Residue:360
BDBM143560
NameBDBM143560
Synonyms:US9682955, 58
TypeSmall organic molecule
Emp. Form.C33H31ClN4O
Mol. Mass.535.078
SMILESCOc1ccc(cc1)C(c1ccc(Cl)cc1)c1ccc2ncnc(NC3CCN(CC3)c3ccccc3)c2c1