Reaction Details
TargetCannabinoid receptor 1
LigandBDBM143559
Substrate/Competitorn/a
Meas. Tech.cAMP Assay
Temperature300.15±n/a K
EC50 1.00±n/a nM
Commentsextracted
Citation Macielag, MJZhang, YDeCorte, BLGreco, MN Quinazoline derivatives useful as CB-1 inverse agonists US Patent US9682955 Publication Date 6/20/2017
 
Cannabinoid receptor 1
Name:Cannabinoid receptor 1
Type:G Protein-Coupled Receptor (GPCR)
Mol. Mass.:52868.96
Organism:Homo sapiens (Human)
Description:P21554
Residue:472
BDBM143559
NameBDBM143559
Synonyms:US9682955, 67
TypeSmall organic molecule
Emp. Form.C32H28F2N4
Mol. Mass.506.5883
SMILESFc1ccc(cc1)C(c1ccc(F)cc1)c1ccc2ncnc(NC3CCN(CC3)c3ccccc3)c2c1