Reaction Details
TargetCannabinoid receptor 1
LigandBDBM143486
Substrate/Competitorn/a
Meas. Tech.cAMP Assay
Temperature300.15±n/a K
EC50 2.00±n/a nM
Commentsextracted
Citation Macielag, MJZhang, YDeCorte, BLGreco, MN Quinazoline derivatives useful as CB-1 inverse agonists US Patent US9682955 Publication Date 6/20/2017
 
Cannabinoid receptor 1
Name:Cannabinoid receptor 1
Type:G Protein-Coupled Receptor (GPCR)
Mol. Mass.:52868.96
Organism:Homo sapiens (Human)
Description:P21554
Residue:472
BDBM143486
NameBDBM143486
Synonyms:US9682955, 137
TypeSmall organic molecule
Emp. Form.C32H28Cl2N4
Mol. Mass.539.498
SMILESClc1ccc(cc1)C(c1ccc(Cl)cc1)c1ccc2ncnc(NC3CCN(CC3)c3ccccc3)c2c1