Reaction Details
TargetcAMP-specific 3',5'-cyclic phosphodiesterase 4B [122-736,S654A]
LigandBDBM285555
Substrate/Competitorn/a
Meas. Tech.The PDE4A3, PDE4B1, PDE4C1 and PDE4D3 assays
IC50 31.7±n/a nM
Citation Chappie, TAPatel, NCHayward, MMHelal, CJSciabola, SLaChapelle, EAYoung, JMVerhoest, PR Imidazopyridazine compounds US Patent US10077269 Publication Date 9/18/2018
 
cAMP-specific 3',5'-cyclic phosphodiesterase 4B [122-736,S654A]
Name:cAMP-specific 3',5'-cyclic phosphodiesterase 4B [122-736,S654A]
Type:Enzyme Catalytic Domain
Mol. Mass.:70253.85
Organism:Homo sapiens (Human)
Description:Q07343[122-736,S654A]
Residue:615
BDBM285555
NameBDBM285555
Synonyms:3-(3,5-dichlorophenyl)-N-propylimidazo[1,2-b]pyridazine-2-carboxamide US10669279, Example 28 | US9598421, Example 28
TypeSmall organic molecule
Emp. Form.C16H14Cl2N4O
Mol. Mass.349.215
SMILESCCCNC(=O)c1nc2cccnn2c1-c1cc(Cl)cc(Cl)c1