Reaction Details
TargetIsoform 3 of cAMP-specific 3',5'-cyclic phosphodiesterase 4D (hPDE4D3)
LigandBDBM285568
Substrate/Competitorn/a
Meas. Tech.The PDE4A3, PDE4B1, PDE4C1 and PDE4D3 assays
IC50 16.8±n/a nM
Citation Chappie, TAPatel, NCHayward, MMHelal, CJSciabola, SLaChapelle, EAYoung, JMVerhoest, PR Imidazopyridazine compounds US Patent US10077269 Publication Date 9/18/2018
 
Isoform 3 of cAMP-specific 3',5'-cyclic phosphodiesterase 4D (hPDE4D3)
Name:Isoform 3 of cAMP-specific 3',5'-cyclic phosphodiesterase 4D (hPDE4D3)
Type:n/a
Mol. Mass.:76431.39
Organism:Homo sapiens (Human)
Description:Q08499-2
Residue:673
BDBM285568
NameBDBM285568
Synonyms:N-cyclopropyl-3-(3-fluoro-4-methylphenyl)imidazo[1,2-b]pyridazine-2-carboxamide US10669279, Example 41 | US9598421, Example 41
TypeSmall organic molecule
Emp. Form.C17H15FN4O
Mol. Mass.310.3256
SMILESCc1ccc(cc1F)-c1c(nc2cccnn12)C(=O)NC1CC1