Reaction Details
TargetIsoform 3 of cAMP-specific 3',5'-cyclic phosphodiesterase 4D (hPDE4D3)
LigandBDBM285571
Substrate/Competitorn/a
Meas. Tech.The PDE4A3, PDE4B1, PDE4C1 and PDE4D3 assays
IC50 320±n/a nM
Citation Chappie, TAPatel, NCHayward, MMHelal, CJSciabola, SLaChapelle, EAYoung, JMVerhoest, PR Imidazopyridazine compounds US Patent US10077269 Publication Date 9/18/2018
 
Isoform 3 of cAMP-specific 3',5'-cyclic phosphodiesterase 4D (hPDE4D3)
Name:Isoform 3 of cAMP-specific 3',5'-cyclic phosphodiesterase 4D (hPDE4D3)
Type:n/a
Mol. Mass.:76431.39
Organism:Homo sapiens (Human)
Description:Q08499-2
Residue:673
BDBM285571
NameBDBM285571
Synonyms:3-(4-chloro-3-fluorophenyl)-N-(2,2-difluorocyclopro-pyl)imidazo[1,2-b]pyridazine-2-carboxamide US10669279, Example 44 | US9598421, Example 44
TypeSmall organic molecule
Emp. Form.C16H10ClF3N4O
Mol. Mass.366.725
SMILESFc1cc(ccc1Cl)-c1c(nc2cccnn12)C(=O)NC1CC1(F)F