Reaction Details
TargetIsoform 3 of cAMP-specific 3',5'-cyclic phosphodiesterase 4D (hPDE4D3)
LigandBDBM285613
Substrate/Competitorn/a
Meas. Tech.The PDE4A3, PDE4B1, PDE4C1 and PDE4D3 assays
IC50 495±n/a nM
Citation Chappie, TAPatel, NCHayward, MMHelal, CJSciabola, SLaChapelle, EAYoung, JMVerhoest, PR Imidazopyridazine compounds US Patent US10077269 Publication Date 9/18/2018
 
Isoform 3 of cAMP-specific 3',5'-cyclic phosphodiesterase 4D (hPDE4D3)
Name:Isoform 3 of cAMP-specific 3',5'-cyclic phosphodiesterase 4D (hPDE4D3)
Type:n/a
Mol. Mass.:76431.39
Organism:Homo sapiens (Human)
Description:Q08499-2
Residue:673
BDBM285613
NameBDBM285613
Synonyms:US10077269, Example 83 US9598421, Example 83 | azetidin-1-yl[3-(3,4-dichloro-phenyl)imidazo[1,2-b]pyridazin-2-yl]methanone
TypeSmall organic molecule
Emp. Form.C16H12Cl2N4O
Mol. Mass.347.199
SMILESClc1ccc(cc1Cl)-c1c(nc2cccnn12)C(=O)N1CCC1