Reaction Details
TargetIsoform 4 of cAMP-specific 3',5'-cyclic phosphodiesterase 4A (RD1)
LigandBDBM285622
Substrate/Competitorn/a
Meas. Tech.The PDE4A3, PDE4B1, PDE4C1 and PDE4D3 assays
IC50 5.52±n/a nM
Citation Chappie, TAPatel, NCHayward, MMHelal, CJSciabola, SLaChapelle, EAYoung, JMVerhoest, PR Imidazopyridazine compounds US Patent US10077269 Publication Date 9/18/2018
 
Isoform 4 of cAMP-specific 3',5'-cyclic phosphodiesterase 4A (RD1)
Name:Isoform 4 of cAMP-specific 3',5'-cyclic phosphodiesterase 4A (RD1)
Type:Enzyme Catalytic Domain
Mol. Mass.:72186.86
Organism:Homo sapiens (Human)
Description:P27815-4
Residue:647
BDBM285622
NameBDBM285622
Synonyms:3-(4-cyano-2,5-difluorophenyl)-N-cyclopropylimidazo[1,2-b]pyridazine-2-carboxamide US10669279, Example 92 | US9598421, Example 92
TypeSmall organic molecule
Emp. Form.C17H11F2N5O
Mol. Mass.339.2989
SMILESFc1cc(-c2c(nc3cccnn23)C(=O)NC2CC2)c(F)cc1C#N