Reaction Details
TargetIsoform 3 of cAMP-specific 3',5'-cyclic phosphodiesterase 4D (hPDE4D3)
LigandBDBM285624
Substrate/Competitorn/a
Meas. Tech.The PDE4A3, PDE4B1, PDE4C1 and PDE4D3 assays
IC50 65.0±n/a nM
Citation Chappie, TAPatel, NCHayward, MMHelal, CJSciabola, SLaChapelle, EAYoung, JMVerhoest, PR Imidazopyridazine compounds US Patent US10077269 Publication Date 9/18/2018
 
Isoform 3 of cAMP-specific 3',5'-cyclic phosphodiesterase 4D (hPDE4D3)
Name:Isoform 3 of cAMP-specific 3',5'-cyclic phosphodiesterase 4D (hPDE4D3)
Type:n/a
Mol. Mass.:76431.39
Organism:Homo sapiens (Human)
Description:Q08499-2
Residue:673
BDBM285624
NameBDBM285624
Synonyms:3-(4-chloro-3-fluorophenyl)-N-methylimidazo[1,2-b]pyridazine-2-carboxamide US10669279, Example 94 | US9598421, Example 94
TypeSmall organic molecule
Emp. Form.C14H10ClFN4O
Mol. Mass.304.707
SMILESCNC(=O)c1nc2cccnn2c1-c1ccc(Cl)c(F)c1