Reaction Details
TargetIsoform 4 of cAMP-specific 3',5'-cyclic phosphodiesterase 4A (RD1)
LigandBDBM285626
Substrate/Competitorn/a
Meas. Tech.The PDE4A3, PDE4B1, PDE4C1 and PDE4D3 assays
IC50 4.58±n/a nM
Citation Chappie, TAPatel, NCHayward, MMHelal, CJSciabola, SLaChapelle, EAYoung, JMVerhoest, PR Imidazopyridazine compounds US Patent US10077269 Publication Date 9/18/2018
 
Isoform 4 of cAMP-specific 3',5'-cyclic phosphodiesterase 4A (RD1)
Name:Isoform 4 of cAMP-specific 3',5'-cyclic phosphodiesterase 4A (RD1)
Type:Enzyme Catalytic Domain
Mol. Mass.:72186.86
Organism:Homo sapiens (Human)
Description:P27815-4
Residue:647
BDBM285626
NameBDBM285626
Synonyms:3-(4-chloro-2,5-difluoro-phenyl)-N-ethylimidazo[1,2-b]pyridazine-2-carboxamide US10669279, Example 96 | US9598421, Example 96
TypeSmall organic molecule
Emp. Form.C15H11ClF2N4O
Mol. Mass.336.724
SMILESCCNC(=O)c1nc2cccnn2c1-c1cc(F)c(Cl)cc1F