Reaction Details
TargetcAMP-specific 3',5'-cyclic phosphodiesterase 4B [122-736,S654A]
LigandBDBM285634
Substrate/Competitorn/a
Meas. Tech.The PDE4A3, PDE4B1, PDE4C1 and PDE4D3 assays
IC50 1.59±n/a nM
Citation Chappie, TAPatel, NCHayward, MMHelal, CJSciabola, SLaChapelle, EAYoung, JMVerhoest, PR Imidazopyridazine compounds US Patent US10077269 Publication Date 9/18/2018
 
cAMP-specific 3',5'-cyclic phosphodiesterase 4B [122-736,S654A]
Name:cAMP-specific 3',5'-cyclic phosphodiesterase 4B [122-736,S654A]
Type:Enzyme Catalytic Domain
Mol. Mass.:70253.85
Organism:Homo sapiens (Human)
Description:Q07343[122-736,S654A]
Residue:615
BDBM285634
NameBDBM285634
Synonyms:3-(4-chloro-3,5-difluoro-phenyl)-N-cyclopropyl-imidazo[1,2-b]pyridazine-2-carboxamide US10669279, Example 104 | US9598421, Example 104
TypeSmall organic molecule
Emp. Form.C16H11ClF2N4O
Mol. Mass.348.735
SMILESFc1cc(cc(F)c1Cl)-c1c(nc2cccnn12)C(=O)NC1CC1