Reaction Details
TargetOpioid growth factor receptor-like protein 1
LigandBDBM12256
Substrate/Competitorn/a
Meas. Tech.Radioligand Binding Assay
pH7.4±n/a
Ki 3.1±n/a nM
Commentsextracted
Citation Fuchino, KGoehring, RRShao, BTaoda, YTsuno, NWhitehead, JWYao, J Substituted-quinoxaline-type piperidine compounds and the uses thereof US Patent US8846929 Publication Date 9/30/2014
 
Opioid growth factor receptor-like protein 1
Name:Opioid growth factor receptor-like protein 1
Type:Protein
Mol. Mass.:51247.53
Organism:Homo sapiens (Human)
Description:Q5TC84
Residue:451
BDBM12256
NameBDBM12256
Synonyms:US8846929, 120
Typen/a
Emp. Form.C31H39N5O3
Mol. Mass.529.6731
SMILES[H][C@]12CC[C@]([H])(C[C@@](C)(C1)n1c3ccccc3nc(C(=O)Nc3ccc(OC)nc3)c1=O)N2C1CCCCCCC1