Reaction Details
TargetOpioid growth factor receptor-like protein 1
LigandBDBM133914
Substrate/Competitorn/a
Meas. Tech.Radioligand Binding Assay
pH7.4±n/a
Ki 6.42±n/a nM
Commentsextracted
Citation Fuchino, KGoehring, RRShao, BTaoda, YTsuno, NWhitehead, JWYao, J Substituted-quinoxaline-type piperidine compounds and the uses thereof US Patent US8846929 Publication Date 9/30/2014
 
Opioid growth factor receptor-like protein 1
Name:Opioid growth factor receptor-like protein 1
Type:Protein
Mol. Mass.:51247.53
Organism:Homo sapiens (Human)
Description:Q5TC84
Residue:451
BDBM133914
NameBDBM133914
Synonyms:US8846929, 90
TypeSmall organic molecule
Emp. Form.C25H35N5O2
Mol. Mass.437.5777
SMILESNC(=O)CNc1nc2ccccc2n([C@@H]2C[C@@H]3CC[C@H](C2)N3C2CCCCCCC2)c1=O