Reaction Details
TargetOpioid growth factor receptor-like protein 1
LigandBDBM11758
Substrate/Competitorn/a
Meas. Tech.Radioligand Binding Assay
pH7.4±n/a
Ki 4.42±n/a nM
Commentsextracted
Citation Fuchino, KGoehring, RRShao, BTaoda, YTsuno, NWhitehead, JWYao, J Substituted-quinoxaline-type piperidine compounds and the uses thereof US Patent US8846929 Publication Date 9/30/2014
 
Opioid growth factor receptor-like protein 1
Name:Opioid growth factor receptor-like protein 1
Type:Protein
Mol. Mass.:51247.53
Organism:Homo sapiens (Human)
Description:Q5TC84
Residue:451
BDBM11758
NameBDBM11758
Synonyms:US8846929, 94
Typen/a
Emp. Form.C24H32N4O2
Mol. Mass.408.5365
SMILES[H][C@]12CC[C@]([H])(C[C@@]([H])(C1)n1c3ccccc3nc(C(N)=O)c1=O)N2C1CCCCCCC1