Reaction Details
TargetFocal adhesion kinase 1
LigandBDBM134066
Substrate/Competitorn/a
Meas. Tech.Enzyme Assay
pH7.5±n/a
IC50 1±n/a nM
Commentsextracted
Citation Stadtmueller, HSapountzis, I Substituted pyrimidines for the treatment of diseases such as cancer US Patent US8846689 Publication Date 9/30/2014
 
Focal adhesion kinase 1
Name:Focal adhesion kinase 1
Type:Tyrosine-protein kinase
Mol. Mass.:119233.17
Organism:Homo sapiens (Human)
Description:Q05397
Residue:1052
BDBM134066
NameBDBM134066
Synonyms:US8846689, 68
TypeSmall organic molecule
Emp. Form.C28H28ClF3N6O4
Mol. Mass.605.008
SMILESCOc1cc(C(=O)NC2CCN(C)CC2)c(Cl)cc1Nc1ncc(c(Oc2cccc3CN(C)C(=O)c23)n1)C(F)(F)F