Reaction Details
TargetFocal adhesion kinase 1
LigandBDBM134115
Substrate/Competitorn/a
Meas. Tech.Enzyme Assay
pH7.5±n/a
IC50 1±n/a nM
Commentsextracted
Citation Stadtmueller, HSapountzis, I Substituted pyrimidines for the treatment of diseases such as cancer US Patent US8846689 Publication Date 9/30/2014
 
Focal adhesion kinase 1
Name:Focal adhesion kinase 1
Type:Tyrosine-protein kinase
Mol. Mass.:119233.17
Organism:Homo sapiens (Human)
Description:Q05397
Residue:1052
BDBM134115
NameBDBM134115
Synonyms:US8846689, 117
TypeSmall organic molecule
Emp. Form.C28H29F3N6O5
Mol. Mass.586.5623
SMILESCON1Cc2cccc(Oc3nc(Nc4ccc(cc4OC)C(=O)N[C@@H]4CCCN(C)C4)ncc3C(F)(F)F)c2C1=O