Reaction Details
TargetFocal adhesion kinase 1
LigandBDBM134179
Substrate/Competitorn/a
Meas. Tech.Enzyme Assay
pH7.5±n/a
IC50 1±n/a nM
Commentsextracted
Citation Stadtmueller, HSapountzis, I Substituted pyrimidines for the treatment of diseases such as cancer US Patent US8846689 Publication Date 9/30/2014
 
Focal adhesion kinase 1
Name:Focal adhesion kinase 1
Type:Tyrosine-protein kinase
Mol. Mass.:119233.17
Organism:Homo sapiens (Human)
Description:Q05397
Residue:1052
BDBM134179
NameBDBM134179
Synonyms:US8846689, 181
TypeSmall organic molecule
Emp. Form.C23H20F3N5O5
Mol. Mass.503.4306
SMILESCONC(=O)c1ccc(Nc2ncc(c(Oc3cccc4CN(C)C(=O)c34)n2)C(F)(F)F)c(OC)c1