Reaction Details
TargetCyclin-dependent kinase 7
LigandBDBM50358235
Substrate/Competitorn/a
Meas. Tech.Kinase Assay
pH7.4±n/a
IC50 1500±n/a nM
Commentsextracted
Citation Fischer, PMJarman, MMcDonald, ENutley, BRaynaud, FWilson, SWorkman, P Purine derivatives US Patent US8846696 Publication Date 9/30/2014
 
Cyclin-dependent kinase 7
Name:Cyclin-dependent kinase 7
Type:Enzyme Subunit
Mol. Mass.:39047.01
Organism:Homo sapiens (Human)
Description:n/a
Residue:346
BDBM50358235
NameBDBM50358235
Synonyms:CHEMBL1922209 | US8846696, (3RS,4S)-4-{9-Isopropyl-6-[(pyridin-3-ylmethyl)-amino]-9H-purin-2-ylamino}-hexan-3-ol
TypeSmall organic molecule
Emp. Form.C20H29N7O
Mol. Mass.383.4906
SMILESCCC(O)[C@H](CC)Nc1nc(NCc2cccnc2)c2ncn(C(C)C)c2n1