Reaction Details
TargetC5a anaphylatoxin chemotactic receptor 1
LigandBDBM134531
Substrate/Competitorn/a
Meas. Tech.FLIPR Assay
IC50 0.5±n/a nM
Citation Adams, CMDarsigny, VFlyer, ANGelin, CFHurley, TBJi, NKarki, RGKawanami, TMeredith, ERao, CSerrano-Wu, MHSolovay, CF Tetrahydropyrido-pyridine and tetrahydropyrido-pyrimidine compounds and use thereof as C5a receptor modulators US Patent US8846656 Publication Date 9/30/2014
 
C5a anaphylatoxin chemotactic receptor 1
Name:C5a anaphylatoxin chemotactic receptor 1
Type:Enzyme
Mol. Mass.:39347.68
Organism:Homo sapiens (Human)
Description:P21730
Residue:350
BDBM134531
NameBDBM134531
Synonyms:US8846656, 23-I
TypeSmall organic molecule
Emp. Form.C31H40N8O
Mol. Mass.540.7023
SMILESCO[C@@H]1CCN(CC1(C)C)c1nc(nc2CCN(Cc12)c1cc(nn1C)C1CC1)-c1c(C)ccc2[nH]nc(C)c12