Reaction Details
TargetC5a anaphylatoxin chemotactic receptor 1
LigandBDBM134546
Substrate/Competitorn/a
Meas. Tech.FLIPR Assay
IC50 2±n/a nM
Citation Adams, CMDarsigny, VFlyer, ANGelin, CFHurley, TBJi, NKarki, RGKawanami, TMeredith, ERao, CSerrano-Wu, MHSolovay, CF Tetrahydropyrido-pyridine and tetrahydropyrido-pyrimidine compounds and use thereof as C5a receptor modulators US Patent US8846656 Publication Date 9/30/2014
 
C5a anaphylatoxin chemotactic receptor 1
Name:C5a anaphylatoxin chemotactic receptor 1
Type:Enzyme
Mol. Mass.:39347.68
Organism:Homo sapiens (Human)
Description:P21730
Residue:350
BDBM134546
NameBDBM134546
Synonyms:US8846656, 29
TypeSmall organic molecule
Emp. Form.C32H40N6O2S
Mol. Mass.572.764
SMILESCC(C)c1ccc(C)c(c1)N1CCc2nc(nc(N3CCN([C@H](C)C3)S(C)(=O)=O)c2C1)-c1cccc2[nH]cc(C)c12