Reaction Details
TargetC5a anaphylatoxin chemotactic receptor 1
LigandBDBM134551
Substrate/Competitorn/a
Meas. Tech.FLIPR Assay
IC50 2±n/a nM
Citation Adams, CMDarsigny, VFlyer, ANGelin, CFHurley, TBJi, NKarki, RGKawanami, TMeredith, ERao, CSerrano-Wu, MHSolovay, CF Tetrahydropyrido-pyridine and tetrahydropyrido-pyrimidine compounds and use thereof as C5a receptor modulators US Patent US8846656 Publication Date 9/30/2014
 
C5a anaphylatoxin chemotactic receptor 1
Name:C5a anaphylatoxin chemotactic receptor 1
Type:Enzyme
Mol. Mass.:39347.68
Organism:Homo sapiens (Human)
Description:P21730
Residue:350
BDBM134551
NameBDBM134551
Synonyms:US8846656, 32-B
TypeSmall organic molecule
Emp. Form.C33H41ClN6O
Mol. Mass.573.171
SMILESCO[C@H]1CCN(CC1(C)C)c1nc(nc2CCN(Cc12)c1cc(ccc1C)C(C)C)-c1c(C)ccc2[nH]nc(Cl)c12