Reaction Details
TargetC5a anaphylatoxin chemotactic receptor 1
LigandBDBM134515
Substrate/Competitorn/a
Meas. Tech.FLIPR Assay
IC50 4±n/a nM
Citation Adams, CMDarsigny, VFlyer, ANGelin, CFHurley, TBJi, NKarki, RGKawanami, TMeredith, ERao, CSerrano-Wu, MHSolovay, CF Tetrahydropyrido-pyridine and tetrahydropyrido-pyrimidine compounds and use thereof as C5a receptor modulators US Patent US8846656 Publication Date 9/30/2014
 
C5a anaphylatoxin chemotactic receptor 1
Name:C5a anaphylatoxin chemotactic receptor 1
Type:Enzyme
Mol. Mass.:39347.68
Organism:Homo sapiens (Human)
Description:P21730
Residue:350
BDBM134515
NameBDBM134515
Synonyms:US8846656, 21-AB
TypeSmall organic molecule
Emp. Form.C31H37F3N4O
Mol. Mass.538.6469
SMILESCO[C@@H]1CCN(CC1(C)C)c1nc(nc2CCN(Cc12)c1cc(ccc1C)C(F)(F)F)-c1c(C)cccc1C